﻿شناسه,نوع,شناسه محصول,نام,منتشر شده,قابل مشاهده در کاتالوگ,توضیح کوتاه,توضیحات,در انبار؟,فروش به صورت جداگانه؟,یادداشت خرید,قیمت عادی,دسته‌ها,برچسب‌ها,تصاویر,روز انقضای دانلود,نام 1 دانلود,آدرس URL 1 دانلود,متا: pageview,متا: somdn_dlcount,متا: _per_product_admin_commission_type,متا: _per_product_admin_commission,متا: _per_product_admin_additional_fee,متا: pr_product_video,متا: _pr_product_video,متا: pr_product_info,متا: _pr_product_info,متا: pr_product_links,متا: _pr_product_links,متا: pr_product_faq,متا: _pr_product_faq,متا: pr_product_pro,متا: _pr_product_pro,متا: pr_product_iran,متا: _pr_product_iran,متا: pr_product_qi,متا: _pr_product_qi,متا: pr_product_original,متا: _pr_product_original,متا: cybocfi_hide_featured_image,متا: _yoast_wpseo_content_score,متا: _yoast_wpseo_focuskeywords,متا: _yoast_wpseo_keywordsynonyms,متا: _yoast_wpseo_primary_product_cat,متا: pr_product_info_0_pr_product_info_icon,متا: _pr_product_info_0_pr_product_info_icon,متا: pr_product_info_0_pr_product_info_title,متا: _pr_product_info_0_pr_product_info_title,متا: pr_product_info_0_pr_product_info_value,متا: _pr_product_info_0_pr_product_info_value,متا: pr_product_info_1_pr_product_info_icon,متا: _pr_product_info_1_pr_product_info_icon,متا: pr_product_info_1_pr_product_info_title,متا: _pr_product_info_1_pr_product_info_title,متا: pr_product_info_1_pr_product_info_value,متا: _pr_product_info_1_pr_product_info_value,متا: pr_product_info_2_pr_product_info_icon,متا: _pr_product_info_2_pr_product_info_icon,متا: pr_product_info_2_pr_product_info_title,متا: _pr_product_info_2_pr_product_info_title,متا: pr_product_info_2_pr_product_info_value,متا: _pr_product_info_2_pr_product_info_value,متا: pr_product_links_0_pr_product_links_title,متا: _pr_product_links_0_pr_product_links_title,متا: pr_product_links_0_pr_product_links_url,متا: _pr_product_links_0_pr_product_links_url,متا: pr_product_links_0_pr_product_links_color,متا: _pr_product_links_0_pr_product_links_color,متا: _yoast_wpseo_focuskw,متا: _yoast_wpseo_linkdex,متا: _yoast_wpseo_metadesc,متا: rank_math_primary_product_cat,متا: rank_math_description,متا: rank_math_focus_keyword,متا: rank_math_news_sitemap_robots,متا: rank_math_internal_links_processed,متا: rank_math_seo_score,متا: rank_math_dont_show_seo_score,متا: rank_math_facebook_enable_image_overlay,متا: rank_math_facebook_image_overlay,متا: rank_math_twitter_use_facebook,متا: rank_math_twitter_card_type,متا: rank_math_twitter_enable_image_overlay,متا: rank_math_twitter_image_overlay,متا: rank_math_title,متا: _yoast_wpseo_title,متا: rank_math_permalink,متا: _rank_math_gtin_code
4376,"simple, downloadable, virtual",eagle-paradise-vector-symblo,وکتور نماد عقاب - سمبل عقاب - پرنده اسرار آمیز - Eagle Symbol Vectr,1,visible,دانلود وکتور نماد عقاب - سمبل عقاب - پرنده اسرار آمیز - Eagle Symbol Vectr,<h1>دانلود وکتور نماد عقاب - سمبل عقاب - پرنده اسرار آمیز - Eagle Symbol Vecrot</h1>,1,1,از خرید شما متشکریم. به امید دیدار مجدد شما.,15001,"حیوانات, وکتور","وکتور عقاب, عکس, فایل, بال, باز, اسرار آمیز, Eagle, Vector,symbole,پرنده, درحال پرواز, بهشت",https://samgraph.ir/wp-content/uploads/2020/12/OGHAB-Nemad-Eagle-symbols-vector-image.png,30,دانلود وکتور عقاب,https://dl.samgraph.ir/files-logo/OGHAB-Nemad-Eagle-symbols-vector-image.zip,3,,flat,,,1194,field_5e6092f94e1dd,4,field_5e4805e1162e8,2,field_5e487705413d0,,field_5e5126c55468b,0,field_5f5098d94b30b,1,field_5f509911dddef,0,field_5f509921dddf0,0,field_5f509939dddf1,,90,"[{""keyword"":""طرح آماده بنر کرونا ویروس "",""score"":""ok""},{""keyword"":""دست ضد عفونی سطوح ماسک الکل"",""score"":""bad""}]","[""بهداشت محیط کرونا آموزش Corona virus"",""corona virus vector donload"",""اتانول شستشو دست ها ""]",1097,fa fa-file-alt,field_5e480639162e9,فرمت های موجود در فایل,field_5e480689162ea,"CDR, PDF , Ai",field_5e480699162eb,fas fa-expand,field_5e480639162e9,حجم فایل,field_5e480689162ea,,field_5e480699162eb,fas fa-search-plus,field_5e480639162e9,رزولوشن,field_5e480689162ea,بدون محدودیت در بزرگنمایی,field_5e480699162eb,گزارش خرابی لینک,field_5e487756413d1,https://samgraph.ir/%DA%AF%D8%B2%D8%A7%D8%B1%D8%B4-%D8%AE%D8%B1%D8%A7%D8%A8%DB%8C-%D9%84%DB%8C%D9%86%DA%A9-%D8%AF%D8%A7%D9%86%D9%84%D9%88%D8%AF/,field_5e487767413d2,#81d742,field_5e487774413d3,وکتور عقاب ,,دانلود وکتور نماد عقاب - سمبل عقاب - پرنده اسرار آمیز - Eagle Symbol Vecrot,,دانلود وکتور نماد عقاب - سمبل عقاب - پرنده اسرار آمیز - Eagle Symbol Vecrot بصورت برداری با قابلیت تغییر رنگ و ویرایش طرح بدون محدودیت کیفیت بهینه شده در نرم افزار کورل دراو ایلاستریتور,"وکتور عقاب،عکس عقاب،عقاب اسرار آمیز،Eagle,vetor",index,1,,off,off,play,on,summary_large_image,off,play,دانلود وکتور نماد عقاب - سمبل عقاب - پرنده اسرار آمیز,,,
,,,,,,,"دانلود <a href=""https://samgraph.ir/product-category/%d9%88%da%a9%d8%aa%d9%88%d8%b1/"" target=""_blank"" rel=""noopener"" data-schema-attribute=""about mentions"">وکتور</a> نماد عقاب - سمبل عقاب - پرنده اسرار آمیز - Eagle Symbol Vecrot بصورت برداری با قابلیت تغییر رنگ و ویرایش طرح بدون محدودیت کیفیت بهینه شده در نرم افزار کورل دراو ایلاستریتور",,,,,,,,,,,,,,,,,,,,,,,,,,,,,,,,,,,,,,,,,,,,,,,,,,,,,,,,,,,,,,,,,,,,,,,,,,,,,,,,
,,,,,,,,,,,,,,,,,,,,,,,,,,,,,,,,,,,,,,,,,,,,,,,,,,,,,,,,,,,,,,,,,,,,,,,,,,,,,,,,,,,,,,,
,,,,,,,فرمت های وکتور عقاب موجود در فایل دانلود,,,,,,,,,,,,,,,,,,,,,,,,,,,,,,,,,,,,,,,,,,,,,,,,,,,,,,,,,,,,,,,,,,,,,,,,,,,,,,,,
,,,,,,,,,,,,,,,,,,,,,,,,,,,,,,,,,,,,,,,,,,,,,,,,,,,,,,,,,,,,,,,,,,,,,,,,,,,,,,,,,,,,,,,
,,,,,,,pdf - Ai - CDR,,,,,,,,,,,,,,,,,,,,,,,,,,,,,,,,,,,,,,,,,,,,,,,,,,,,,,,,,,,,,,,,,,,,,,,,,,,,,,,,
,,,,,,,,,,,,,,,,,,,,,,,,,,,,,,,,,,,,,,,,,,,,,,,,,,,,,,,,,,,,,,,,,,,,,,,,,,,,,,,,,,,,,,,
,,,,,,,بال های باز نمای روبرو,,,,,,,,,,,,,,,,,,,,,,,,,,,,,,,,,,,,,,,,,,,,,,,,,,,,,,,,,,,,,,,,,,,,,,,,,,,,,,,,
